{"text_format":"1","workbook":"xlsx","n_sheets":7,"sheets":["Read Me First","Device_Cabinet_Data","Cabinet Features","Cabinet Dimensions","AMS-Features","Configurator","Sheet1"],"not_rendered":{"charts":0,"images":22,"macros":1,"external_links":0,"defined_names":1,"comments":1,"pivot_tables":0},"unopened":[],"bounds":{"document_bytes":16777216,"sheet_cells":100000,"rows_first":2000,"rows_last":500,"rows_between":2000,"halvings":0,"cell_chars":16384,"cell_head_chars":4096},"cells_cut":0,"cells_raw":0,"read":"whole","date_system":"1900"}

{"sheet":"Read Me First","index":0,"n_rows":37,"n_cols":3,"rows_kept":37,"cut":false,"hidden":false,"merged":[[26,1,26,2],[28,1,28,2],[30,1,30,2],[32,1,32,2],[36,1,36,2],[27,1,27,2],[23,5,23,8],[24,5,24,8],[25,5,25,8],[1,1,1,2],[2,1,2,2],[4,1,4,2],[6,1,6,2],[7,1,7,2],[8,1,8,2],[10,1,10,2],[21,1,21,2],[23,1,23,2],[25,1,25,2]]}
[]
[null,"Intelligent Cabinets configurator"]
[null,"Note: Latest version of this downloadable Configurator is stored on Solutions Pathway"]
[]
[null,"Preparation"]
[]
[null,"Examine the \"Cabinet Features\" Sheet to understand the Cabinets hardware features"]
[null,"The \"Cabinet Dimensions\" Sheet provides images of Cabinet size options and dimension details."]
[null,"Read the \"AMS-Features\" Sheet to get an understanding of what the Access Management System features and benefits are."]
[]
{"$rows_left_out":28}
{"sheet":"Device_Cabinet_Data","index":1,"n_rows":141,"n_cols":34,"rows_kept":141,"cut":false,"hidden":true,"merged":[[1,0,1,31],[55,0,55,20],[43,0,43,20],[66,5,66,9],[66,12,66,17],[66,19,66,21],[76,0,76,6],[76,8,76,14],[76,18,76,19],[67,23,67,24],[66,0,66,3],[103,0,103,5],[82,16,82,20],[98,0,98,2],[91,0,91,1],[91,3,91,6],[91,13,91,15],[91,8,91,11]]}
[null,null,null,null,null,null,null,null,null,null,null,null,null,9,55,60]
["Table 813"]
[1,2,3,4,5,6,7,8,9,10,11,12,13,14,15,16,17,18,19,20,21,22,23,24,25,26,27,28,29,30,31,32,33,34]
["Device","Cradle Lock Compatible","Unit Value","Toaster Option","Devices Per Cradle","Device \nDepth","Compact \nCL","Compact\n No CL","Small\nCL","Small\nNo CL","Midi\nCL","Midi\nNo CL","Large\nCL","Large\nNo CL","X-Large\nCL","X-Large\nNo CL","Extreme\nCL","Extreme\nNo CL","Row Value","Stadium Compatible","Extra Shelf","Cradle Lock","Cradle Lock - Toaster","Cradle w/Toaster","Devices with Toaster","Pistol Grip Angle","Pistol Grip Straight","Devices per layer","Aux Bracket Rqd","Aux  € Bracket Price","Aux £  Bracket Price","Aux  $ Bracket Price","AMS Compatible","Shared Cradle"]
["None",0,0,0,0,0,0,0,0,0,0,0,0,0,0,0,0,0,0,0,0,null,null,0,0,0,0,0,null,null,null,null,0,0]
["EC30",0,5,0,10,1,10,10,40,40,60,60,100,100,120,120,240,240,1,1,1,null,null,0,0,0,0,{"$f":"Table813[[#This Row],[Devices Per Cradle]]*(T6+1)","v":20},null,null,null,null,1,1]
["EC50",0,5,0,5,1,5,5,20,20,30,30,50,50,60,60,120,120,2,1,1,null,null,0,0,1,0,{"$f":"Table813[[#This Row],[Devices Per Cradle]]*(T7+1)","v":10},null,null,null,null,1,1]
["EC55",0,5,0,5,1,5,5,20,20,30,30,50,50,60,60,120,120,3,1,1,null,null,0,0,1,0,{"$f":"Table813[[#This Row],[Devices Per Cradle]]*(T8+1)","v":10},null,null,null,null,1,1]
["TC20",1,5,0,5,1,5,5,20,20,25,30,45,50,50,60,100,120,4,1,1,"CS-CRD-LOC-TC2",null,0,0,0,1,{"$f":"Table813[[#This Row],[Devices Per Cradle]]*(T9+1)","v":10},null,null,null,null,1,1]
["TC25",1,5,0,5,1,5,5,20,20,25,30,45,50,50,60,100,120,5,1,1,"CS-CRD-LOC-TC2",null,0,0,0,1,{"$f":"Table813[[#This Row],[Devices Per Cradle]]*(T10+1)","v":10},null,null,null,null,1,1]
{"$rows_left_out":132}
{"sheet":"Cabinet Features","index":2,"n_rows":55,"n_cols":31,"rows_kept":55,"cut":false,"hidden":false,"merged":[[48,20,49,25],[1,20,17,25],[51,1,56,2],[51,3,53,4],[54,3,56,4],[52,20,54,32],[51,5,53,18],[54,5,56,18],[12,27,12,31],[28,27,28,31],[27,27,27,31],[30,27,30,31],[1,0,1,16],[3,0,3,16],[18,20,19,25]]}
[]
["Cabinet Detail"]
[]
["(Colours used for illustration purposes only)"]
[null,null,null,null,null,null,null,null,null,null,null,null,null,null,"Sloping Lid - Aids ventilation"]
[]
[]
[]
[]
[null,null,null,null,null,null,null,null,null,null,null,null,null,null,"Right hand bi-fold door"]
{"$rows_left_out":46}
{"sheet":"Cabinet Dimensions","index":3,"n_rows":19,"n_cols":9,"rows_kept":19,"cut":false,"hidden":false,"merged":[[14,2,25,2],[14,0,15,0],[14,8,25,8],[14,3,25,3],[14,5,25,5],[14,7,25,7],[14,4,25,4],[14,6,25,6]]}
[]
[null,"Small","Small with Base","Midi","Midi with Base","Large","Large with Base","X-Large","Extreme"]
["Height","1000mm, 39.4\"","1300mm,   51.2\"","1300mm,   51.2\"","1600mm,   63\"","1600mm,   63\"","1900mm,   74.8\"","1900mm,   74.8\"","1900mm,   74.8\""]
["Width","700mm,   27.5\"","700mm,   27.5\"","700mm,   27.5\"","700mm,   27.5\"","700mm,   27.5\"","700mm,   27.5\"","700mm,   27.5\"","1200mm,   47.2\""]
["Depth","440mm,   17.3\"","440mm,   17.3\"","440mm,   17.3\"","440mm,   17.3\"","440mm,   17.3\"","440mm,   17.3\"","440mm,   17.3\"","440mm,   17.3\""]
["Cabinet Weight","44kg,   97lbs","66kg,   145.5lbs","57kg,   125.6lbs","79kg,   174lbs","70kg,   154lbs","92kg,   202.8lbs","83kg, 182.9lbs","124kg,   273.4lbs"]
["Shelf Weight","2.7kg,   5.9lbs","2.7kg,   5.9lbs","2.7kg,   5.9lbs","2.7kg,   5.9lbs","2.7kg,   5.9lbs","2.7kg,   5.9lbs","2.7kg,   5.9lbs","5kg,   11lbs"]
["Stadium Shelf Weight","1.2kg,   2.6lbs","1.2kg,   2.6lbs","1.2kg,   2.6lbs","1.2kg,   2.6lbs","1.2kg,   2.6lbs","1.2kg,   2.6lbs","1.2kg,   2.6lbs","2.4kg, 5.2lbs"]
["Cables included with Cabinet",null,"2 x IEC","2 x IEC, 1 x IEC-L","2 x IEC, 1 x IEC-L","3 x IEC, 1 x IEC-L","3 x IEC, 1 x IEC-L","3 x IEC, 2 x IEC-L","6 x IEC, 4 x IEC-L"]
["Slots\n(No of potential shelf locations)",10,10,14,14,18,18,22,44]
{"$rows_left_out":10}
{"sheet":"AMS-Features","index":4,"n_rows":55,"n_cols":20,"rows_kept":55,"cut":false,"hidden":false,"merged":[[0,0,0,26],[54,1,54,18],[54,19,54,27],[52,1,52,14],[52,15,52,27]]}
["AMS Features and Benefits"]
[]
[]
[]
[]
[]
[]
[]
[]
[]
{"$rows_left_out":46}
{"sheet":"Configurator","index":5,"n_rows":38,"n_cols":46,"rows_kept":38,"cut":false,"hidden":false,"merged":[[11,8,11,9],[1,23,1,27],[2,23,2,27],[2,29,2,33],[1,29,1,33],[1,17,1,21],[2,17,2,21],[1,7,1,13],[11,10,11,11],[11,12,11,13],[4,7,11,7],[2,41,2,45],[1,41,1,45],[2,35,2,39],[1,35,1,39],[20,1,20,2],[13,7,16,7],[18,7,23,7],[17,1,17,2],[14,1,14,2],[21,1,21,2],[22,1,22,2],[19,1,19,2],[13,1,13,2],[16,1,16,2],[18,1,18,2],[2,7,2,13],[23,1,23,2],[16,12,16,13],[15,12,15,13],[14,12,14,13],[13,12,13,13],[15,8,15,10],[16,8,16,10],[13,8,13,10],[14,8,14,10],[11,1,11,2],[15,1,15,2],[0,1,0,4],[10,1,10,2],[8,1,8,2],[9,1,9,2],[7,1,7,2],[4,1,5,2],[4,3,5,3],[1,1,1,3],[2,1,2,3],[12,1,12,2],[23,43,23,44],[23,37,23,38],[5,44,5,45],[4,41,4,45],[5,20,5,21],[4,17,4,21],[5,26,5,27],[4,23,4,27],[5,38,5,39],[4,35,4,39],[5,32,5,33],[4,29,4,33],[23,31,23,32],[23,25,23,26],[23,19,23,20]]}
["210325"]
[null,"Data Input",null,null,null,null,null,"Recommended configuration",null,null,null,null,null,null,null,null,"Z3br4","Bill Of Materials and SKU List",null,null,null,null,null,"Bill Of Materials and SKU List",null,null,null,null,null,"Bill Of Materials and SKU List",null,null,null,null,null,"Bill Of Materials and SKU List",null,null,null,null,null,"Bill Of Materials and SKU List"]
[null,"Enter data and select options in the drop down menus highlighted in blue below.",null,null,null,null,null,"Optimal cabinet choice based upon cost and capacity, and assumes the same cabinet type is used.  Alternative considerations and cabinet combinations are listed further below.  \nPricing may change and is for comparisson purposes only. Please refer to Solution Pathway or Partner Gateway for latest pricing.",null,null,null,null,null,null,null,null,null,"Use the SKUs and Quantities (Qty) listed below to generate quotes using your quoting tool, such as Solutions Pathway.",null,null,null,null,null,"Use the SKUs and Quantities (Qty) listed below to generate quotes using your quoting tool, such as Solutions Pathway.",null,null,null,null,null,"Use the SKUs and Quantities (Qty) listed below to generate quotes using your quoting tool, such as Solution Pathway.",null,null,null,null,null,"Use the SKUs and Quantities (Qty) listed below to generate quotes using your quoting tool, such as Solution Pathway.",null,null,null,null,null,"Use the SKUs and Quantities (Qty) listed below to generate quotes using your quoting tool, such as Solution Pathway."]
[]
[null,"Number of Mobile Devices per Location",null,100,null,null,null,"Same Cabinet Type \nSolution",null,"Extreme","X-Large","Large","Midi","Small",null,null,null,{"$f":"Device_Cabinet_Data!A52","v":"Extreme"},null,null,null,null,null,{"$f":"Device_Cabinet_Data!A51","v":"X-Large"},null,null,null,null,null,{"$f":"Device_Cabinet_Data!A50","v":"Large"},null,null,null,null,null,{"$f":"Device_Cabinet_Data!A49","v":"Midi"},null,null,null,null,null,{"$f":"Device_Cabinet_Data!A48","v":"Small"}]
[null,null,null,null,null,null,null,null,"Devices per cabinet",{"$f":"$G$12/$F$12*(IF(AND($D$20=\"No\",$F$19=1),$J$13/2,IF($D$22=\"Yes\", VLOOKUP($D$9,Table813[],17,FALSE),$J13)))","v":100},{"$f":"$G$12/$F$12*(IF(AND($D$20=\"No\",$F$19=1),$K$13/2,IF($D$22=\"Yes\", VLOOKUP($D$9,Table813[],15,FALSE),$K13)))","v":50},{"$f":"$G$12/$F$12*(IF(AND($D$20=\"No\",$F$19=1),$L$13/2,IF(AND($D$22=\"Yes\",$D$23<>\"Base\"),VLOOKUP($D$9,Table813[],13,FALSE),$L13)))","v":40},{"$f":"$G$12/$F$12*(IF(AND($D$20=\"No\",$F$19=1),$M$13/2,IF(AND($D$22=\"Yes\",$D$23=\"None\"), VLOOKUP($D$9,Table813[],11,FALSE),$M13)))","v":30},{"$f":"$G$12/$F$12*(IF(AND($D$20=\"No\",$F$19=1),$N$13/2,IF(AND($D$22=\"Yes\",$D$23=\"None\"), VLOOKUP($D$9,Table813[],9,FALSE),$N13)))","v":20},null,null,null,"Floor Area",{"$f":"IF($G$10=\"NA\", _xlfn.CONCAT(R$25,Device_Cabinet_Data!$R$71), _xlfn.CONCAT(R$25,Device_Cabinet_Data!$R$69))","v":"0.52m²"},"Wall Area",{"$f":"IF($G$10=\"NA\",_xlfn.CONCAT(R$26,Device_Cabinet_Data!$R$71),_xlfn.CONCAT(R$26,Device_Cabinet_Data!$R$69))","v":"2.29m²"},null,null,"Floor Area",{"$f":"IF($G$10=\"NA\", _xlfn.CONCAT(X$25,Device_Cabinet_Data!$R$71), _xlfn.CONCAT(X$25,Device_Cabinet_Data!$R$69))","v":"1.05m²"},"Wall Area",{"$f":"IF($G$10=\"NA\",_xlfn.CONCAT(X$26,Device_Cabinet_Data!$R$71),_xlfn.CONCAT(X$26,Device_Cabinet_Data!$R$69))","v":"2.68m²"},null,null,"Floor Area",{"$f":"IF($G$10=\"NA\", _xlfn.CONCAT(AD$25,Device_Cabinet_Data!$R$71), _xlfn.CONCAT(AD$25,Device_Cabinet_Data!$R$69))","v":"1.57m²"},"Wall Area",{"$f":"IF($G$10=\"NA\",_xlfn.CONCAT(AD$26,Device_Cabinet_Data!$R$71),_xlfn.CONCAT(AD$26,Device_Cabinet_Data!$R$69))","v":"3.39m²"},null,null,"Floor Area",{"$f":"IF($G$10=\"NA\", _xlfn.CONCAT(AJ$25,Device_Cabinet_Data!$R$71), _xlfn.CONCAT(AJ$25,Device_Cabinet_Data!$R$69))","v":"2.1m²"},"Wall Area",{"$f":"IF($G$10=\"NA\",_xlfn.CONCAT(AJ$26,Device_Cabinet_Data!$R$71),_xlfn.CONCAT(AJ$26,Device_Cabinet_Data!$R$69))","v":"3.67m²"},null,null,"Floor Area",{"$f":"IF($G$10=\"NA\", _xlfn.CONCAT(AP$25,Device_Cabinet_Data!$R$71), _xlfn.CONCAT(AP$25,Device_Cabinet_Data!$R$69))","v":"2.62m²"},"Wall Area",{"$f":"IF($G$10=\"NA\",_xlfn.CONCAT(AP$26,Device_Cabinet_Data!$R$71),_xlfn.CONCAT(AP$26,Device_Cabinet_Data!$R$69))","v":"3.54m²"}]
[null,null,null,null,null,null,null,null,"No of Cabinets Required",{"$f":" IF(INT($D$5/J$6)=0,  \"1\",ROUNDUP($D$5/J$6,0))","v":1},{"$f":" IF(INT($D$5/K$6)=0,  \"1\",ROUNDUP($D$5/K$6,0))","v":2},{"$f":" IF(INT($D$5/L$6)=0,  \"1\",ROUNDUP($D$5/L$6,0))","v":3},{"$f":" IF(INT($D$5/M$6)=0,  \"1\",ROUNDUP($D$5/M$6,0))","v":4},{"$f":" IF(INT($D$5/N$6)=0,  \"1\",ROUNDUP($D$5/N$6,0))","v":5},null,null,null,"Product Build","SKU","Unit Price","Qty","Total",null,"Product Build","SKU","Unit Price","Qty","Total",null,"Product Build","SKU","Unit Price","Qty","Total",null,"Product Build","SKU","Unit Price","Qty","Total",null,"Product Build","SKU","Unit Price","Qty","Total"]
[null,"Flat Pack",null,"Yes",null,null,null,null,"Stadium Shelves Rqd",{"$f":"IF($F$20=1,J7*((VLOOKUP(J5,Table10[],13,FALSE))+1-$F$22),0)","v":5},{"$f":"IF($F$20=1,K7*((VLOOKUP(K5,Table10[],13,FALSE))+1-$F$22),0)","v":10},{"$f":"IF($F$20=1,L7*((VLOOKUP(L5,Table10[],13,FALSE))+1-($F$22*$F$23)),0)","v":12},{"$f":"IF($F$20=1,M7*((VLOOKUP(M5,Table10[],13,FALSE))+1-($F$22*$F$23)),0)","v":12},{"$f":"IF($F$20=1,N7*((VLOOKUP(N5,Table10[],13,FALSE))+1),0)","v":10},null,null,null,{"$f":"IF($G$10<>\"NA\",\"Cabinets\",IF($D$16=\"Yes\",\"Cabinets with CC6\",\"Cabinets w/o CC6\"))","v":"Cabinets"},{"$f":"IF($G$10<>\"NA\",IF($D$8=\"Yes\",Device_Cabinet_Data!$S$64,Device_Cabinet_Data!$B$64),IF($D$16=\"No\",Device_Cabinet_Data!$D64,Device_Cabinet_Data!$F64))","v":"CS-CAB-5EXT-B-FLTPK"},{"$f":"VLOOKUP(S8, SKU_Price[], IF($G$10=\"EU\",2,IF($G$10=\"UK\",3,IF($G$10=\"NA\",4,0))),FALSE)","v":5743.08},{"$f":"IF($G$10=\"NA\",IF($D$16=\"Yes\",ROUNDUP(Configurator!$J$7/$D$17,0),$J$7),$J$7)","v":1},{"$f":"IFERROR(IF(U8>0,T8*U8,\"\"),\"\")","v":5743.08},null,{"$f":"IF($G$10<>\"NA\",\"Cabinets\",IF($D$16=\"Yes\",\"Cabinets with CC6\",\"Cabinets w/o CC6\"))","v":"Cabinets"},{"$f":"IF($G$10<>\"NA\",IF($D$8=\"Yes\",Device_Cabinet_Data!$S$63,Device_Cabinet_Data!$B$63),IF($D$16=\"No\",Device_Cabinet_Data!$D63,Device_Cabinet_Data!$F63))","v":"CS-CAB-5XL-B-FLTPK"},{"$f":"VLOOKUP(Y8, SKU_Price[], IF($G$10=\"EU\",2,IF($G$10=\"UK\",3,IF($G$10=\"NA\",4,0))),FALSE)","v":3481.88},{"$f":"IF($G$10=\"NA\",IF($D$16=\"Yes\",ROUNDUP(Configurator!$K$7/$D$17,0),$K$7),$K$7)","v":2},{"$f":"IFERROR(IF(AA8>0,Z8*AA8,\"\"),\"\")","v":6963.76},null,{"$f":"IF($G$10<>\"NA\",\"Cabinets\",IF($D$16=\"Yes\",\"Cabinets with CC6\",\"Cabinets w/o CC6\"))","v":"Cabinets"},{"$f":"IF($G$10<>\"NA\",IF($D$8=\"Yes\",Device_Cabinet_Data!$S$62,Device_Cabinet_Data!$B$62),IF($D$16=\"No\",Device_Cabinet_Data!$D62,Device_Cabinet_Data!$F62))","v":"CS-CAB-4-B-FLTPK"},{"$f":"VLOOKUP(AE8, SKU_Price[], IF($G$10=\"EU\",2,IF($G$10=\"UK\",3,IF($G$10=\"NA\",4,0))),FALSE)","v":2524.41},{"$f":"IF($G$10=\"NA\",IF($D$16=\"Yes\",ROUNDUP(Configurator!$L$7/$D$17,0),$L$7),$L$7)","v":3},{"$f":"IFERROR(IF(AG8>0,AF8*AG8,\"\"),\"\")","v":7573.23},null,{"$f":"IF($G$10<>\"NA\",\"Cabinets\",IF($D$16=\"Yes\",\"Cabinets with CC6\",\"Cabinets w/o CC6\"))","v":"Cabinets"},{"$f":"IF($G$10<>\"NA\",IF($D$8=\"Yes\",Device_Cabinet_Data!$S$61,Device_Cabinet_Data!$B$61),IF($D$16=\"No\",Device_Cabinet_Data!$D61,Device_Cabinet_Data!$F61))","v":"CS-CAB-3-B-FLTPK"},{"$f":"VLOOKUP(AK8, SKU_Price[], IF($G$10=\"EU\",2,IF($G$10=\"UK\",3,IF($G$10=\"NA\",4,0))),FALSE)","v":2216.6799999999998},{"$f":"IF($G$10=\"NA\",IF($D$16=\"Yes\",ROUNDUP(Configurator!$M$7/$D$17,0),$M$7),$M$7)","v":4},{"$f":"IFERROR(IF(AM8>0,AL8*AM8,\"\"),\"\")","v":8866.7199999999993},null,{"$f":"IF($G$10<>\"NA\",\"Cabinets\",IF($D$16=\"Yes\",\"Cabinets with CC6\",\"Cabinets w/o CC6\"))","v":"Cabinets"},{"$f":"IF($G$10<>\"NA\",IF($D$8=\"Yes\",Device_Cabinet_Data!$S$60,Device_Cabinet_Data!$B$60),IF($D$16=\"No\",Device_Cabinet_Data!$D60,Device_Cabinet_Data!$F60))","v":"CS-CAB-2-B-FLTPK"},{"$f":"VLOOKUP(AQ8, SKU_Price[], IF($G$10=\"EU\",2,IF($G$10=\"UK\",3,IF($G$10=\"NA\",4,0))),FALSE)","v":1506.5},{"$f":"IF($G$10=\"NA\",IF($D$16=\"Yes\",ROUNDUP(Configurator!$N$7/$D$17,0),$N$7),$N$7)","v":5},{"$f":"IFERROR(IF(AS8>0,AR8*AS8,\"\"),\"\")","v":7532.5}]
[null,"Select Your Device",null,"TC57",{"$f":"VLOOKUP(D9,Table813[[Device]:[Unit Value]],3,)","v":5},null,null,null,"Expansion\nCapacity",{"$f":"(J7*J6)-$D$5","v":0},{"$f":"(K7*K6)-$D$5","v":0},{"$f":"(L7*L6)-$D$5","v":20},{"$f":"(M7*M6)-$D$5","v":20},{"$f":"(N7*N6)-$D$5","v":0},null,null,null,{"$f":"IF(AND($G$10=\"NA\",U$9<>\"\"),\"Cabinets, w/o CC6\",\"\")","v":""},{"$f":"IF(AND($G$10=\"NA\",U9<>\"\"),IF(AND($D$14<>1,$J$7>1),VLOOKUP(Configurator!$J$5,Table13[[#All],[Cabinet]:[NA-C6-Bundeled Price]],4,FALSE),\"\"),\"\")","v":""},{"$f":"IF(AND(U9<>\"\",$G$10=\"NA\"),IF(AND($D$14<>1,$J$7>1),VLOOKUP(Configurator!$J$5,Table13[[#All],[Cabinet]:[NA-C6-Bundeled Price]],5,FALSE),\"\"),\"\")","v":""},{"$f":"IF($G$10=\"NA\",IF($J$7-$U$8=0,\"\",$J$7-$U$8),\"\")","v":""},{"$f":"IFERROR(IF(U9>0,T9*U9,\"\"),\"\")","v":""},null,{"$f":"IF(AND($G$10=\"NA\",AA$9<>\"\"),\"Cabinets, w/o CC6\",\"\")","v":""},{"$f":"IF(AND(AA9<>\"\",$G$10=\"NA\"),IF(AND($D$14<>1,$K$7>1),VLOOKUP(Configurator!$K$5,Table13[[#All],[Cabinet]:[NA-C6-Bundeled Price]],4,FALSE),\"\"),\"\")","v":""},{"$f":"IF(AND(AA9<>\"\",$G$10=\"NA\"),IF(AND($D$14<>1,$K$7>1),VLOOKUP(Configurator!$K$5,Table13[[#All],[Cabinet]:[NA-C6-Bundeled Price]],5,FALSE),\"\"),\"\")","v":""},{"$f":"IF($G$10=\"NA\",IF($K$7-$AA$8=0,\"\",$K$7-$AA$8),\"\")","v":""},{"$f":"IFERROR(IF(AA9>0,Z9*AA9,\"\"),\"\")","v":""},null,{"$f":"IF(AND($G$10=\"NA\",AG$9<>\"\"),\"Cabinets, w/o CC6\",\"\")","v":""},{"$f":"IF(AND(AG9<>\"\",$G$10=\"NA\"),IF(AND($D$14<>1,$L$7>1),VLOOKUP(Configurator!$L$5,Table13[[#All],[Cabinet]:[NA-C6-Bundeled Price]],4,FALSE),\"\"),\"\")","v":""},{"$f":"IF(AND(AG9<>\"\",$G$10=\"NA\"),IF(AND($D$14<>1,$L$7>1),VLOOKUP(Configurator!$L$5,Table13[[#All],[Cabinet]:[NA-C6-Bundeled Price]],5,FALSE),\"\"),\"\")","v":""},{"$f":"IF($G$10=\"NA\",IF($L$7-AG$8=0,\"\",$L$7-AG$8),\"\")","v":""},"",null,{"$f":"IF(AND($G$10=\"NA\",AM$9<>\"\"),\"Cabinets, w/o CC6\",\"\")","v":""},{"$f":"IF(AND(AM9<>\"\",$G$10=\"NA\"),IF(AND($D$14<>1,$M$7>1),VLOOKUP(Configurator!$M$5,Table13[[#All],[Cabinet]:[NA-C6-Bundeled Price]],4,FALSE),\"\"),\"\")","v":""},{"$f":"IF(AND(AM9<>\"\",$G$10=\"NA\"),IF(AND($D$14<>1,$M$7>1),VLOOKUP(Configurator!$M$5,Table13[[#All],[Cabinet]:[NA-C6-Bundeled Price]],5,FALSE),\"\"),\"\")","v":""},{"$f":"IF($G$10=\"NA\",IF($M$7-AM$8=0,\"\",$M$7-AM$8),\"\")","v":""},"",null,{"$f":"IF(AND($G$10=\"NA\",AS$9<>\"\"),\"Cabinets, w/o CC6\",\"\")","v":""},{"$f":"IF(AND(AS9<>\"\",$G$10=\"NA\"),IF(AND($D$14<>1,$N$7>1),VLOOKUP(Configurator!$N$5,Table13[[#All],[Cabinet]:[NA-C6-Bundeled Price]],4,FALSE),\"\"),\"\")","v":""},{"$f":"IF(AND(AS9<>\"\",$G$10=\"NA\"),IF(AND($D$14<>1,$N$7>1),VLOOKUP(Configurator!$N$5,Table13[[#All],[Cabinet]:[NA-C6-Bundeled Price]],5,FALSE),\"\"),\"\")","v":""},{"$f":"IF($G$10=\"NA\",IF($N$7-AS$8=0,\"\",$N$7-AS$8),\"\")","v":""},""]
[null,"Select Your Country",null,"Europe",{"$f":"VLOOKUP(D10,Table2[],2,FALSE)","v":"CS-CAB-EU-MLEAD"},{"$f":"VLOOKUP(D10,Table2[],5,FALSE)","v":"€"},{"$f":"VLOOKUP(D10,Table2[],4,FALSE)","v":"EU"},null,"IEC Socket per Cabinet",{"$f":"VLOOKUP(J5,Table10[],25,FALSE)","v":28},{"$f":"VLOOKUP(K5,Table10[],25,FALSE)","v":14},{"$f":"VLOOKUP(L5,Table10[],25,FALSE)","v":14},{"$f":"VLOOKUP(M5,Table10[],25,FALSE)","v":14},{"$f":"VLOOKUP(N5,Table10[],25,FALSE)","v":14},null,null,null,"Power Cable",{"$f":"Configurator!$E$10","v":"CS-CAB-EU-MLEAD"},{"$f":"VLOOKUP(Configurator!$D$10,Table2[],3,FALSE)","v":7.7},{"$f":"Configurator!J7*2","v":2},{"$f":"IFERROR(IF(U10>0,T10*U10,\"\"),\"\")","v":15.4},null,"Power Cable",{"$f":"Configurator!$E$10","v":"CS-CAB-EU-MLEAD"},{"$f":"VLOOKUP(Configurator!$D$10,Table2[],3,FALSE)","v":7.7},{"$f":"Configurator!K7","v":2},{"$f":"IFERROR(IF(AA10>0,Z10*AA10,\"\"),\"\")","v":15.4},null,"Power Cable",{"$f":"Configurator!$E$10","v":"CS-CAB-EU-MLEAD"},{"$f":"VLOOKUP(Configurator!$D$10,Table2[],3,FALSE)","v":7.7},{"$f":"Configurator!L7","v":3},{"$f":"IFERROR(IF(AG10>0,AF10*AG10,\"\"),\"\")","v":23.1},null,"Power Cable",{"$f":"Configurator!$E$10","v":"CS-CAB-EU-MLEAD"},{"$f":"VLOOKUP(Configurator!$D$10,Table2[],3,FALSE)","v":7.7},{"$f":"Configurator!M7","v":4},{"$f":"IFERROR(IF(AM10>0,AL10*AM10,\"\"),\"\")","v":30.8},null,"Power Cable",{"$f":"Configurator!$E$10","v":"CS-CAB-EU-MLEAD"},{"$f":"VLOOKUP(Configurator!$D$10,Table2[],3,FALSE)","v":7.7},{"$f":"Configurator!N7","v":5},{"$f":"IFERROR(IF(AS10>0,AR10*AS10,\"\"),\"\")","v":38.5}]
{"$rows_left_out":29}
{"sheet":"Sheet1","index":6,"n_rows":23,"n_cols":7,"rows_kept":23,"cut":false,"hidden":true,"merged":[[18,6,18,7],[20,6,20,7],[22,6,22,7],[12,6,12,7],[9,6,9,7],[10,6,10,7],[11,6,11,7],[14,6,14,7],[15,6,15,7],[17,6,17,7],[14,1,14,2],[15,1,15,2],[16,1,16,2],[17,1,17,2],[2,6,2,7],[3,6,3,7],[4,6,4,7],[5,6,5,7],[7,6,7,7],[8,6,8,7],[8,1,8,2],[9,1,9,2],[10,1,10,2],[11,1,11,2],[12,1,12,2],[13,1,13,2],[7,1,7,2],[2,1,2,2],[3,1,3,2],[4,1,4,2],[5,1,5,2],[6,1,6,2]]}
[]
[]
[null,"Select Your Device",null,"D9","Same","D9","Select Your Device"]
[null,"Select Your Country",null,"D10","Same","D10","Select Your Country"]
[null,"Cradles with Battery Charger",null,"D11","Same","D11","Cradles with Battery Charger"]
[null,"Qty of Cradles to be housed",null,"D12","Same","D12","Qty of Cradles to be housed"]
[null,"Use CC6000",null,"D13"]
[null,"Cabinets per CC6000",null,"D14",null,"D13","AMS Compatible"]
[null,"CC6000 Mount",null,"D15",null,"D14","Access Management System"]
[null,"TC8xxx Vertical Bracket",null,"D16",null,"D15","AMS License Duration"]
{"$rows_left_out":13}